Reaction Details
TargetD(2) dopamine receptor
LigandBDBM50027074
Substrate/Competitorn/a
Meas. Tech.ChEMBL_1439003 (CHEMBL3383110)
IC50>100000±n/a nM
Citation Berry, CBBubser, MJones, CKHayes, JPWepy, JALocuson, CWDaniels, JSLindsley, CWHopkins, CR Discovery and Characterization of ML398, a Potent and Selective Antagonist of the D4 Receptor with in Vivo Activity. ACS Med Chem Lett5:1060-4 (2014) 
 
D(2) dopamine receptor
Name:D(2) dopamine receptor
Type:Cell-surface receptors
Mol. Mass.:50647.10
Organism:Homo sapiens (Human)
Description:P14416
Residue:443
BDBM50027074
NameBDBM50027074
Synonyms:CHEMBL3335537
TypeSmall organic molecule
Emp. Form.C20H23N3O
Mol. Mass.321.4161
SMILESC(Cc1ccccc1)[C@@H]1CN(Cc2nc3ccccc3[nH]2)CCO1