Reaction Details
TargetCholinesterase
LigandBDBM50027375
Substrate/Competitorn/a
Meas. Tech.ChEMBL_1442176 (CHEMBL3375249)
Ki 2.7±n/a nM
Citation Brus, BKo?ak, UTurk, SPi?lar, ACoquelle, NKos, JStojan, JColletier, JPGobec, S Discovery, biological evaluation, and crystal structure of a novel nanomolar selective butyrylcholinesterase inhibitor. J Med Chem57:8167-79 (2014) 
 
Cholinesterase
Name:Cholinesterase
Type:Homotetramer
Mol. Mass.:68422.27
Organism:Homo sapiens (Human)
Description:P06276
Residue:602
BDBM50027375
NameBDBM50027375
Synonyms:CHEMBL3338394
TypeSmall organic molecule
Emp. Form.C29H34N2O2
Mol. Mass.442.5925
SMILESCOCCN(C[C@@H]1CCCN(C1)C1Cc2ccccc2C1)C(=O)c1ccc2ccccc2c1