Reaction Details
TargetHistone deacetylase 6
LigandBDBM50027649
Substrate/Competitorn/a
Meas. Tech.ChEMBL_1443003 (CHEMBL3379481)
IC50 1.000000±n/a nM
Citation Giannini, GVesci, LBattistuzzi, GVignola, DMilazzo, FMGuglielmi, MBBarbarino, MSantaniello, MFantò, NMor, MRivara, SPala, DTaddei, MPisano, CCabri, W ST7612AA1, a thioacetate-¿(¿-lactam carboxamide) derivative selected from a novel generation of oral HDAC inhibitors. J Med Chem57:8358-77 (2014) 
 
Histone deacetylase 6
Name:Histone deacetylase 6
Type:Chromatin regulator; hydrolase; repressor
Mol. Mass.:131381.51
Organism:Homo sapiens (Human)
Description:Q9UBN7
Residue:1215
BDBM50027649
NameBDBM50027649
Synonyms:CHEMBL3356527
TypeSmall organic molecule
Emp. Form.C19H27N3O3S
Mol. Mass.377.501
SMILESSCCCCC[C@H](NC(=O)[C@@H]1CCCNC1=O)C(=O)Nc1ccccc1