Reaction Details
TargetHistone deacetylase 8
LigandBDBM50027589
Substrate/Competitorn/a
Meas. Tech.ChEMBL_1443004 (CHEMBL3379482)
IC50 61±n/a nM
Citation Giannini, GVesci, LBattistuzzi, GVignola, DMilazzo, FMGuglielmi, MBBarbarino, MSantaniello, MFantò, NMor, MRivara, SPala, DTaddei, MPisano, CCabri, W ST7612AA1, a thioacetate-¿(¿-lactam carboxamide) derivative selected from a novel generation of oral HDAC inhibitors. J Med Chem57:8358-77 (2014) 
 
Histone deacetylase 8
Name:Histone deacetylase 8
Type:Enzyme
Mol. Mass.:41749.60
Organism:Homo sapiens (Human)
Description:Q9BY41
Residue:377
BDBM50027589
NameBDBM50027589
Synonyms:CHEMBL3356929
TypeSmall organic molecule
Emp. Form.C17H23N3O3S
Mol. Mass.349.448
SMILESSCCCCC[C@H](NC(=O)[C@@H]1CC(=O)N1)C(=O)Nc1ccccc1