Reaction Details
TargetHistone deacetylase 2
LigandBDBM50027496
Substrate/Competitorn/a
Meas. Tech.ChEMBL_1443001 (CHEMBL3379479)
IC50 33±n/a nM
Citation Giannini, GVesci, LBattistuzzi, GVignola, DMilazzo, FMGuglielmi, MBBarbarino, MSantaniello, MFantò, NMor, MRivara, SPala, DTaddei, MPisano, CCabri, W ST7612AA1, a thioacetate-¿(¿-lactam carboxamide) derivative selected from a novel generation of oral HDAC inhibitors. J Med Chem57:8358-77 (2014) 
 
Histone deacetylase 2
Name:Histone deacetylase 2
Type:Chromatin regulator; hydrolase; repressor
Mol. Mass.:55356.54
Organism:Homo sapiens (Human)
Description:Q92769
Residue:488
BDBM50027496
NameBDBM50027496
Synonyms:CHEMBL3356918
TypeSmall organic molecule
Emp. Form.C18H25N3O3S
Mol. Mass.363.474
SMILESSCCCCC[C@H](NC(=O)[C@@H]1CCC(=O)N1)C(=O)Nc1ccccc1