Reaction Details
TargetHistone deacetylase 1
LigandBDBM50027500
Substrate/Competitorn/a
Meas. Tech.ChEMBL_1443000 (CHEMBL3379478)
IC50 5.0±n/a nM
Citation Giannini, GVesci, LBattistuzzi, GVignola, DMilazzo, FMGuglielmi, MBBarbarino, MSantaniello, MFantò, NMor, MRivara, SPala, DTaddei, MPisano, CCabri, W ST7612AA1, a thioacetate-¿(¿-lactam carboxamide) derivative selected from a novel generation of oral HDAC inhibitors. J Med Chem57:8358-77 (2014) 
 
Histone deacetylase 1
Name:Histone deacetylase 1
Type:Enzyme
Mol. Mass.:55090.27
Organism:Homo sapiens (Human)
Description:Q13547
Residue:482
BDBM50027500
NameBDBM50027500
Synonyms:CHEMBL3356922
TypeSmall organic molecule
Emp. Form.C19H27N3O3S
Mol. Mass.377.501
SMILESCc1cccc(NC(=O)[C@H](CCCCCS)NC(=O)[C@@H]2CCC(=O)N2)c1