Reaction Details
TargetPolyamine deacetylase HDAC10
LigandBDBM50027519
Substrate/Competitorn/a
Meas. Tech.ChEMBL_1443005 (CHEMBL3379483)
IC50 2.0±n/a nM
Citation Giannini, GVesci, LBattistuzzi, GVignola, DMilazzo, FMGuglielmi, MBBarbarino, MSantaniello, MFantò, NMor, MRivara, SPala, DTaddei, MPisano, CCabri, W ST7612AA1, a thioacetate-¿(¿-lactam carboxamide) derivative selected from a novel generation of oral HDAC inhibitors. J Med Chem57:8358-77 (2014) 
 
Polyamine deacetylase HDAC10
Name:Polyamine deacetylase HDAC10
Type:Chromatin regulator; hydrolase; repressor
Mol. Mass.:71431.89
Organism:Homo sapiens (Human)
Description:Q969S8
Residue:669
BDBM50027519
NameBDBM50027519
Synonyms:CHEMBL3356924
TypeSmall organic molecule
Emp. Form.C20H29N3O3S
Mol. Mass.391.528
SMILESCN1[C@H](CCC1=O)C(=O)N[C@@H](CCCCCS)C(=O)Nc1cccc(C)c1