Reaction Details
TargetPolyamine deacetylase HDAC10
LigandBDBM50027588
Substrate/Competitorn/a
Meas. Tech.ChEMBL_1443005 (CHEMBL3379483)
IC50 14±n/a nM
Citation Giannini, GVesci, LBattistuzzi, GVignola, DMilazzo, FMGuglielmi, MBBarbarino, MSantaniello, MFantò, NMor, MRivara, SPala, DTaddei, MPisano, CCabri, W ST7612AA1, a thioacetate-¿(¿-lactam carboxamide) derivative selected from a novel generation of oral HDAC inhibitors. J Med Chem57:8358-77 (2014) 
 
Polyamine deacetylase HDAC10
Name:Polyamine deacetylase HDAC10
Type:Chromatin regulator; hydrolase; repressor
Mol. Mass.:71431.89
Organism:Homo sapiens (Human)
Description:Q969S8
Residue:669
BDBM50027588
NameBDBM50027588
Synonyms:CHEMBL3356928
TypeSmall organic molecule
Emp. Form.C24H29N3O3S
Mol. Mass.439.57
SMILESSCCCCC[C@H](NC(=O)[C@@H]1[C@@H](CNC1=O)c1ccccc1)C(=O)Nc1ccccc1