Reaction Details
TargetHistone deacetylase 11
LigandBDBM50027499
Substrate/Competitorn/a
Meas. Tech.ChEMBL_1443006 (CHEMBL3379484)
IC50 67±n/a nM
Citation Giannini, GVesci, LBattistuzzi, GVignola, DMilazzo, FMGuglielmi, MBBarbarino, MSantaniello, MFantò, NMor, MRivara, SPala, DTaddei, MPisano, CCabri, W ST7612AA1, a thioacetate-¿(¿-lactam carboxamide) derivative selected from a novel generation of oral HDAC inhibitors. J Med Chem57:8358-77 (2014) 
 
Histone deacetylase 11
Name:Histone deacetylase 11
Type:Chromatin regulator; hydrolase; repressor
Mol. Mass.:39187.66
Organism:Homo sapiens (Human)
Description:Q96DB2
Residue:347
BDBM50027499
NameBDBM50027499
Synonyms:CHEMBL3356921
TypeSmall organic molecule
Emp. Form.C19H27N3O3S
Mol. Mass.377.501
SMILESCN1[C@H](CCC1=O)C(=O)N[C@@H](CCCCCS)C(=O)Nc1ccccc1