Reaction Details
TargetFolate receptor beta
LigandBDBM50027659
Substrate/Competitorn/a
Meas. Tech.ChEMBL_1431347 (CHEMBL3387473)
IC50 347±n/a nM
Citation Golani, LKGeorge, CZhao, SRaghavan, SOrr, SWallace, AWilson, MRHou, ZMatherly, LHGangjee, A Structure-activity profiles of novel 6-substituted pyrrolo[2,3-d]pyrimidine thienoyl antifolates with modified amino acids for cellular uptake by folate receptorsa andß and the proton-coupled folate transporter. J Med Chem57:8152-66 (2014) 
 
Folate receptor beta
Name:Folate receptor beta
Type:PROTEIN
Mol. Mass.:29286.32
Organism:Homo sapiens (Human)
Description:ChEMBL_20077
Residue:255
BDBM50027659
NameBDBM50027659
Synonyms:CHEMBL3335604
TypeSmall organic molecule
Emp. Form.C18H19N5O6S
Mol. Mass.433.438
SMILESNc1nc2[nH]c(CCCc3ccc(s3)C(=O)N[C@@H](CC(O)=O)C(O)=O)cc2c(=O)[nH]1