Reaction Details
TargetFolate receptor alpha
LigandBDBM50027657
Substrate/Competitorn/a
Meas. Tech.ChEMBL_1431345 (CHEMBL3387471)
IC50 56±n/a nM
Citation Golani, LKGeorge, CZhao, SRaghavan, SOrr, SWallace, AWilson, MRHou, ZMatherly, LHGangjee, A Structure-activity profiles of novel 6-substituted pyrrolo[2,3-d]pyrimidine thienoyl antifolates with modified amino acids for cellular uptake by folate receptorsa andß and the proton-coupled folate transporter. J Med Chem57:8152-66 (2014) 
 
Folate receptor alpha
Name:Folate receptor alpha
Type:PROTEIN
Mol. Mass.:29827.41
Organism:Homo sapiens (Human)
Description:ChEMBL_1469596
Residue:257
BDBM50027657
NameBDBM50027657
Synonyms:CHEMBL3335607
TypeSmall organic molecule
Emp. Form.C19H23N5O4S
Mol. Mass.417.482
SMILESCCC[C@H](NC(=O)c1ccc(CCCc2cc3c(nc(N)[nH]c3=O)[nH]2)s1)C(O)=O