Reaction Details
TargetHistone deacetylase 9
LigandBDBM50027664
Substrate/Competitorn/a
Meas. Tech.ChEMBL_1433106 (CHEMBL3386363)
IC50 65800±n/a nM
Citation Tang, GWong, JCZhang, WWang, ZZhang, NPeng, ZZhang, ZRong, YLi, SZhang, MYu, LFeng, TZhang, XWu, XWu, JZChen, L Identification of a novel aminotetralin class of HDAC6 and HDAC8 selective inhibitors. J Med Chem57:8026-34 (2014) 
 
Histone deacetylase 9
Name:Histone deacetylase 9
Type:Enzyme
Mol. Mass.:111304.31
Organism:Homo sapiens (Human)
Description:Q9UKV0
Residue:1011
BDBM50027664
NameBDBM50027664
Synonyms:CHEMBL3338404
TypeSmall organic molecule
Emp. Form.C21H19N3O5
Mol. Mass.393.3927
SMILESONC(=O)c1ccc2CCN(Cc3ccc(o3)-c3cccc(c3)[N+]([O-])=O)Cc2c1