Reaction Details
TargetHistone deacetylase 9
LigandBDBM50027662
Substrate/Competitorn/a
Meas. Tech.ChEMBL_1433106 (CHEMBL3386363)
IC50 35000±n/a nM
Citation Tang, GWong, JCZhang, WWang, ZZhang, NPeng, ZZhang, ZRong, YLi, SZhang, MYu, LFeng, TZhang, XWu, XWu, JZChen, L Identification of a novel aminotetralin class of HDAC6 and HDAC8 selective inhibitors. J Med Chem57:8026-34 (2014) 
 
Histone deacetylase 9
Name:Histone deacetylase 9
Type:Enzyme
Mol. Mass.:111304.31
Organism:Homo sapiens (Human)
Description:Q9UKV0
Residue:1011
BDBM50027662
NameBDBM50027662
Synonyms:CHEMBL3338418
TypeSmall organic molecule
Emp. Form.C20H19N5O2
Mol. Mass.361.3972
SMILESONC(=O)c1ccc2CC[C@H](Cc2c1)Nc1nccc(n1)-c1cccnc1