Reaction Details
TargetPolyamine deacetylase HDAC10
LigandBDBM19149
Substrate/Competitorn/a
Meas. Tech.ChEMBL_1433107 (CHEMBL3386364)
IC50 430±n/a nM
Citation Tang, GWong, JCZhang, WWang, ZZhang, NPeng, ZZhang, ZRong, YLi, SZhang, MYu, LFeng, TZhang, XWu, XWu, JZChen, L Identification of a novel aminotetralin class of HDAC6 and HDAC8 selective inhibitors. J Med Chem57:8026-34 (2014) 
 
Polyamine deacetylase HDAC10
Name:Polyamine deacetylase HDAC10
Type:Chromatin regulator; hydrolase; repressor
Mol. Mass.:71431.89
Organism:Homo sapiens (Human)
Description:Q969S8
Residue:669
BDBM19149
NameBDBM19149
Synonyms:CHEMBL98 SAHA US10188756, Compound SAHA US11505523, Compound SAHA US9353061, SAHA US9695181, Vorinostat Zolinza suberoylanilide hydroxamic acid
TypeSmall organic molecule
Emp. Form.C14H20N2O3
Mol. Mass.264.3202
SMILESONC(=O)CCCCCCC(=O)Nc1ccccc1