Reaction Details
TargetHistone deacetylase 6
LigandBDBM120956
Substrate/Competitorn/a
Meas. Tech.ChEMBL_1433094 (CHEMBL3386351)
EC50 8700±n/a nM
Citation Tang, GWong, JCZhang, WWang, ZZhang, NPeng, ZZhang, ZRong, YLi, SZhang, MYu, LFeng, TZhang, XWu, XWu, JZChen, L Identification of a novel aminotetralin class of HDAC6 and HDAC8 selective inhibitors. J Med Chem57:8026-34 (2014) 
 
Histone deacetylase 6
Name:Histone deacetylase 6
Type:Chromatin regulator; hydrolase; repressor
Mol. Mass.:131381.51
Organism:Homo sapiens (Human)
Description:Q9UBN7
Residue:1215
BDBM120956
NameBDBM120956
Synonyms:US8716285, 13
TypeSmall organic molecule
Emp. Form.C21H19ClN4O2
Mol. Mass.394.854
SMILESONC(=O)c1ccc2CCC(Cc2c1)Nc1nccc(n1)-c1ccc(Cl)cc1