Reaction Details
TargetHistone deacetylase 6
LigandBDBM120979
Substrate/Competitorn/a
Meas. Tech.ChEMBL_1433094 (CHEMBL3386351)
EC50 2250±n/a nM
Citation Tang, GWong, JCZhang, WWang, ZZhang, NPeng, ZZhang, ZRong, YLi, SZhang, MYu, LFeng, TZhang, XWu, XWu, JZChen, L Identification of a novel aminotetralin class of HDAC6 and HDAC8 selective inhibitors. J Med Chem57:8026-34 (2014) 
 
Histone deacetylase 6
Name:Histone deacetylase 6
Type:Chromatin regulator; hydrolase; repressor
Mol. Mass.:131381.51
Organism:Homo sapiens (Human)
Description:Q9UBN7
Residue:1215
BDBM120979
NameBDBM120979
Synonyms:US8716285, 36
TypeSmall organic molecule
Emp. Form.C21H21N5O2
Mol. Mass.375.4237
SMILESCN(C1CCc2ccc(cc2C1)C(=O)NO)c1nccc(n1)-c1cccnc1