Reaction Details
TargetPotassium voltage-gated channel subfamily H member 2
LigandBDBM50017376
Substrate/Competitorn/a
Meas. Tech.ChEMBL_1433959 (CHEMBL3390017)
IC50 130±n/a nM
Citation Perlmutter, JIForbes, LTKrysan, DJEbsworth-Mojica, KColquhoun, JMWang, JLDunman, PMFlaherty, DP Repurposing the antihistamine terfenadine for antimicrobial activity against Staphylococcus aureus. J Med Chem57:8540-62 (2014) 
 
Potassium voltage-gated channel subfamily H member 2
Name:Potassium voltage-gated channel subfamily H member 2
Type:Multi-pass membrane protein
Mol. Mass.:126672.65
Organism:Homo sapiens (Human)
Description:Q12809
Residue:1159
BDBM50017376
NameBDBM50017376
Synonyms:(+/-)1-(4-tert-butylphenyl)-4-(4-(hydroxydiphenylmethyl)piperidin-1-yl)butan-1-ol 1-(4-tert-Butyl-phenyl)-4-[4-(hydroxy-diphenyl-methyl)-piperidin-1-yl]-butan-1-ol(Terfenadine) CHEMBL17157 teraenadine
TypeSmall organic molecule
Emp. Form.C32H41NO2
Mol. Mass.471.6734
SMILESCC(C)(C)c1ccc(cc1)C(O)CCCN1CCC(CC1)C(O)(c1ccccc1)c1ccccc1