Reaction Details
Target1,25-dihydroxyvitamin D(3) 24-hydroxylase, mitochondrial
LigandBDBM50027682
Substrate/Competitorn/a
Meas. Tech.ChEMBL_1435383 (CHEMBL3383457)
Ki 31±n/a nM
Citation Ferla, SGomaa, MSBrancale, AZhu, JOchalek, JTDeLuca, HFSimons, C Novel styryl-indoles as small molecule inhibitors of 25-hydroxyvitamin D-24-hydroxylase (CYP24A1): Synthesis and biological evaluation. Eur J Med Chem87:39-51 (2014) 
 
1,25-dihydroxyvitamin D(3) 24-hydroxylase, mitochondrial
Name:1,25-dihydroxyvitamin D(3) 24-hydroxylase, mitochondrial
Type:Protein
Mol. Mass.:58889.66
Organism:Homo sapiens (Human)
Description:Q07973
Residue:514
BDBM50027682
NameBDBM50027682
Synonyms:CHEMBL3344393
TypeSmall organic molecule
Emp. Form.C24H25N3O2
Mol. Mass.387.4742
SMILESCOc1cc(OC)cc(\C=C\c2cccc3n(CCCn4ccnc4)ccc23)c1