Reaction Details
Target1,25-dihydroxyvitamin D(3) 24-hydroxylase, mitochondrial
LigandBDBM50027688
Substrate/Competitorn/a
Meas. Tech.ChEMBL_1435383 (CHEMBL3383457)
Ki 230±n/a nM
Citation Ferla, SGomaa, MSBrancale, AZhu, JOchalek, JTDeLuca, HFSimons, C Novel styryl-indoles as small molecule inhibitors of 25-hydroxyvitamin D-24-hydroxylase (CYP24A1): Synthesis and biological evaluation. Eur J Med Chem87:39-51 (2014) 
 
1,25-dihydroxyvitamin D(3) 24-hydroxylase, mitochondrial
Name:1,25-dihydroxyvitamin D(3) 24-hydroxylase, mitochondrial
Type:Protein
Mol. Mass.:58889.66
Organism:Homo sapiens (Human)
Description:Q07973
Residue:514
BDBM50027688
NameBDBM50027688
Synonyms:CHEMBL3344400
TypeSmall organic molecule
Emp. Form.C27H28N2O2S
Mol. Mass.444.588
SMILESCc1ccc(cc1)S(=O)(=O)NCCCCn1ccc2c(\C=C\c3ccccc3)cccc12