Reaction Details
Target1,25-dihydroxyvitamin D(3) 24-hydroxylase, mitochondrial
LigandBDBM50027686
Substrate/Competitorn/a
Meas. Tech.ChEMBL_1435383 (CHEMBL3383457)
Ki 540±n/a nM
Citation Ferla, SGomaa, MSBrancale, AZhu, JOchalek, JTDeLuca, HFSimons, C Novel styryl-indoles as small molecule inhibitors of 25-hydroxyvitamin D-24-hydroxylase (CYP24A1): Synthesis and biological evaluation. Eur J Med Chem87:39-51 (2014) 
 
1,25-dihydroxyvitamin D(3) 24-hydroxylase, mitochondrial
Name:1,25-dihydroxyvitamin D(3) 24-hydroxylase, mitochondrial
Type:Protein
Mol. Mass.:58889.66
Organism:Homo sapiens (Human)
Description:Q07973
Residue:514
BDBM50027686
NameBDBM50027686
Synonyms:CHEMBL3344402
TypeSmall organic molecule
Emp. Form.C25H23NO2S
Mol. Mass.401.521
SMILESO=S(OCCCn1ccc2c(\C=C\c3ccccc3)cccc12)c1ccccc1