Reaction Details
TargetHistone deacetylase 6
LigandBDBM50397360
Substrate/Competitorn/a
Meas. Tech.ChEMBL_1435420 (CHEMBL3384062)
IC50 2900±n/a nM
Citation Sodji, QPatil, VJain, SKornacki, JRMrksich, MTekwani, BLOyelere, AK The antileishmanial activity of isoforms 6- and 8-selective histone deacetylase inhibitors. Bioorg Med Chem Lett24:4826-30 (2014) 
 
Histone deacetylase 6
Name:Histone deacetylase 6
Type:Chromatin regulator; hydrolase; repressor
Mol. Mass.:131381.51
Organism:Homo sapiens (Human)
Description:Q9UBN7
Residue:1215
BDBM50397360
NameBDBM50397360
Synonyms:CHEMBL2170177 | US10188756, Compound CN110
TypeSmall organic molecule
Emp. Form.C17H16N2O3
Mol. Mass.296.3205
SMILESCOc1ccc(Cn2ccc3ccc(cc23)C(=O)NO)cc1