Reaction Details
TargetHistone deacetylase 6
LigandBDBM50430975
Substrate/Competitorn/a
Meas. Tech.ChEMBL_1435429 (CHEMBL3384071)
IC50 7750±n/a nM
Citation Sodji, QPatil, VJain, SKornacki, JRMrksich, MTekwani, BLOyelere, AK The antileishmanial activity of isoforms 6- and 8-selective histone deacetylase inhibitors. Bioorg Med Chem Lett24:4826-30 (2014) 
 
Histone deacetylase 6
Name:Histone deacetylase 6
Type:Chromatin regulator; hydrolase; repressor
Mol. Mass.:131381.51
Organism:Homo sapiens (Human)
Description:Q9UBN7
Residue:1215
BDBM50430975
NameBDBM50430975
Synonyms:CHEMBL2337867
TypeSmall organic molecule
Emp. Form.C19H17NOS
Mol. Mass.307.409
SMILESCc1ccccc1-c1ccc(Cn2cccc(O)c2=S)cc1