Reaction Details
TargetApelin receptor
LigandBDBM50027852
Substrate/Competitorn/a
Meas. Tech.ChEMBL_1436815 (CHEMBL3386600)
EC50 470±n/a nM
Citation McKeown, SCZecri, FJFortier, ETaggart, ASviridenko, LAdams, CMMcAllister, KHPin, SS The design and implementation of a generic lipopeptide scanning platform to enable the identification of 'locally acting' agonists for the apelin receptor. Bioorg Med Chem Lett24:4871-5 (2014) 
 
Apelin receptor
Name:Apelin receptor
Type:Enzyme Catalytic Domain
Mol. Mass.:42664.06
Organism:Homo sapiens (Human)
Description:P35414
Residue:380
BDBM50027852
NameBDBM50027852
Synonyms:CHEMBL3338677
TypeSmall organic molecule
Emp. Form.C88H137N17O18
Mol. Mass.1721.1325
(=O)N[C@@H](C(C)C)C(=O)N[C@@H]([C@@H](C)O)C(=O)N[C@@H](CC(C)C)C(=O)N1CCC[C@H]1C(=O)N[C@@H](CC(C)C)C(=O)N[C@@H](Cc1c[nH]c2ccccc12)C(=O)N[C@@H](C)C(=O)N[C@@H]([C@@H](C)O)C(=O)N[C@@H](Cc1ccc(O)cc1)C(=O)N[C@@H]([C@@H](C)O)C(=O)N[C@@H](Cc1ccc(O)cc1)C(=O)N[C@@H](CCCNC(N)=N)C(N)=O