Reaction Details
TargetSphingosine 1-phosphate receptor 1
LigandBDBM50027938
Substrate/Competitorn/a
Meas. Tech.ChEMBL_1436858 (CHEMBL3387231)
EC50 0.500000±n/a nM
Citation Horan, JCSanyal, SChoi, YHill-Drzewi, MPatnaude, LAnderson, SFogal, SMao, CCook, BNGueneva-Boucheva, KFisher, MBHickey, EPack, EBannen, LCChan, DSMac, MBNg, SMWang, YXu, WModis, LKLemieux, RM Piperazinyl-oxadiazoles as selective sphingosine-1-phosphate receptor agonists. Bioorg Med Chem Lett24:4807-11 (2014) 
 
Sphingosine 1-phosphate receptor 1
Name:Sphingosine 1-phosphate receptor 1
Type:Enzyme
Mol. Mass.:42836.02
Organism:Homo sapiens (Human)
Description:P21453
Residue:382
BDBM50027938
NameBDBM50027938
Synonyms:CHEMBL3344419
TypeSmall organic molecule
Emp. Form.C21H27ClFN5O3S
Mol. Mass.483.987
SMILESN[C@@H](CO)COc1cc(Cl)c(cc1F)-c1nnc(s1)N1CCN(CC1)C(=O)C1CCCC1