Reaction Details
TargetSphingosine 1-phosphate receptor 1
LigandBDBM50027940
Substrate/Competitorn/a
Meas. Tech.ChEMBL_1436858 (CHEMBL3387231)
EC50 55±n/a nM
Citation Horan, JCSanyal, SChoi, YHill-Drzewi, MPatnaude, LAnderson, SFogal, SMao, CCook, BNGueneva-Boucheva, KFisher, MBHickey, EPack, EBannen, LCChan, DSMac, MBNg, SMWang, YXu, WModis, LKLemieux, RM Piperazinyl-oxadiazoles as selective sphingosine-1-phosphate receptor agonists. Bioorg Med Chem Lett24:4807-11 (2014) 
 
Sphingosine 1-phosphate receptor 1
Name:Sphingosine 1-phosphate receptor 1
Type:Enzyme
Mol. Mass.:42836.02
Organism:Homo sapiens (Human)
Description:P21453
Residue:382
BDBM50027940
NameBDBM50027940
Synonyms:CHEMBL3344421
TypeSmall organic molecule
Emp. Form.C21H27ClFN5O4
Mol. Mass.467.922
SMILESN[C@@H](CO)COc1cc(Cl)c(cc1F)-c1noc(n1)N1CCN(CC1)C(=O)C1CCCC1