Reaction Details
TargetSphingosine 1-phosphate receptor 1
LigandBDBM50027945
Substrate/Competitorn/a
Meas. Tech.ChEMBL_1436858 (CHEMBL3387231)
EC50>5400±n/a nM
Citation Horan, JCSanyal, SChoi, YHill-Drzewi, MPatnaude, LAnderson, SFogal, SMao, CCook, BNGueneva-Boucheva, KFisher, MBHickey, EPack, EBannen, LCChan, DSMac, MBNg, SMWang, YXu, WModis, LKLemieux, RM Piperazinyl-oxadiazoles as selective sphingosine-1-phosphate receptor agonists. Bioorg Med Chem Lett24:4807-11 (2014) 
 
Sphingosine 1-phosphate receptor 1
Name:Sphingosine 1-phosphate receptor 1
Type:Enzyme
Mol. Mass.:42836.02
Organism:Homo sapiens (Human)
Description:P21453
Residue:382
BDBM50027945
NameBDBM50027945
Synonyms:CHEMBL3344426
TypeSmall organic molecule
Emp. Form.C22H22Cl3N5O4
Mol. Mass.526.8
SMILESN[C@@H](CO)COc1c(Cl)cc(cc1Cl)-c1nc(no1)N1CCN(CC1)C(=O)c1cccc(Cl)c1