Reaction Details
TargetSphingosine 1-phosphate receptor 1
LigandBDBM50027957
Substrate/Competitorn/a
Meas. Tech.ChEMBL_1436858 (CHEMBL3387231)
EC50 0.500000±n/a nM
Citation Horan, JCSanyal, SChoi, YHill-Drzewi, MPatnaude, LAnderson, SFogal, SMao, CCook, BNGueneva-Boucheva, KFisher, MBHickey, EPack, EBannen, LCChan, DSMac, MBNg, SMWang, YXu, WModis, LKLemieux, RM Piperazinyl-oxadiazoles as selective sphingosine-1-phosphate receptor agonists. Bioorg Med Chem Lett24:4807-11 (2014) 
 
Sphingosine 1-phosphate receptor 1
Name:Sphingosine 1-phosphate receptor 1
Type:Enzyme
Mol. Mass.:42836.02
Organism:Homo sapiens (Human)
Description:P21453
Residue:382
BDBM50027957
NameBDBM50027957
Synonyms:CHEMBL3341785
TypeSmall organic molecule
Emp. Form.C21H28ClFN5O7P
Mol. Mass.547.901
SMILESN[C@H](COc1cc(Cl)c(cc1F)-c1nc(no1)N1CCN(CC1)C(=O)C1CCCC1)COP(O)(O)=O