Reaction Details
TargetSphingosine 1-phosphate receptor 3
LigandBDBM50027937
Substrate/Competitorn/a
Meas. Tech.ChEMBL_1436859 (CHEMBL3387232)
EC50>10000±n/a nM
Citation Horan, JCSanyal, SChoi, YHill-Drzewi, MPatnaude, LAnderson, SFogal, SMao, CCook, BNGueneva-Boucheva, KFisher, MBHickey, EPack, EBannen, LCChan, DSMac, MBNg, SMWang, YXu, WModis, LKLemieux, RM Piperazinyl-oxadiazoles as selective sphingosine-1-phosphate receptor agonists. Bioorg Med Chem Lett24:4807-11 (2014) 
 
Sphingosine 1-phosphate receptor 3
Name:Sphingosine 1-phosphate receptor 3
Type:G Protein-Coupled Receptor (GPCR)
Mol. Mass.:42278.13
Organism:Homo sapiens (Human)
Description:Q99500
Residue:378
BDBM50027937
NameBDBM50027937
Synonyms:CHEMBL3344418
TypeSmall organic molecule
Emp. Form.C23H26ClFN6O4
Mol. Mass.504.942
SMILESCCc1cccnc1C(=O)N1CCN(CC1)c1noc(n1)-c1cc(F)c(OC[C@@H](N)CO)cc1Cl