Reaction Details
TargetCytochrome b-c1 complex subunit 7
LigandBDBM50027958
Substrate/Competitorn/a
Meas. Tech.ChEMBL_1436866 (CHEMBL3387788)
IC50>20000±n/a nM
Citation Jung, HJCho, MKim, YHan, GKwon, HJ Development of a novel class of mitochondrial ubiquinol-cytochrome c reductase binding protein (UQCRB) modulators as promising antiangiogenic leads. J Med Chem57:7990-8 (2014) 
 
Cytochrome b-c1 complex subunit 7
Name:Cytochrome b-c1 complex subunit 7
Type:PROTEIN
Mol. Mass.:13532.80
Organism:Homo sapiens (Human)
Description:ChEMBL_103899
Residue:111
BDBM50027958
NameBDBM50027958
Synonyms:CHEMBL3360255
TypeSmall organic molecule
Emp. Form.C13H13NO3S
Mol. Mass.263.312
SMILESCc1ccc(cc1)S(=O)(=O)Nc1ccc(O)cc1