Reaction Details
TargetCytochrome b-c1 complex subunit 7
LigandBDBM50027962
Substrate/Competitorn/a
Meas. Tech.ChEMBL_1436866 (CHEMBL3387788)
IC50 20000±n/a nM
Citation Jung, HJCho, MKim, YHan, GKwon, HJ Development of a novel class of mitochondrial ubiquinol-cytochrome c reductase binding protein (UQCRB) modulators as promising antiangiogenic leads. J Med Chem57:7990-8 (2014) 
 
Cytochrome b-c1 complex subunit 7
Name:Cytochrome b-c1 complex subunit 7
Type:PROTEIN
Mol. Mass.:13532.80
Organism:Homo sapiens (Human)
Description:ChEMBL_103899
Residue:111
BDBM50027962
NameBDBM50027962
Synonyms:CHEMBL3360258
TypeSmall organic molecule
Emp. Form.C19H20N2O3S
Mol. Mass.356.439
SMILESCC(C)(C)c1ccc(cc1)S(=O)(=O)Nc1ccc(O)c2ncccc12