Reaction Details
TargetCytochrome b-c1 complex subunit 7
LigandBDBM50028004
Substrate/Competitorn/a
Meas. Tech.ChEMBL_1436866 (CHEMBL3387788)
IC50 5000±n/a nM
Citation Jung, HJCho, MKim, YHan, GKwon, HJ Development of a novel class of mitochondrial ubiquinol-cytochrome c reductase binding protein (UQCRB) modulators as promising antiangiogenic leads. J Med Chem57:7990-8 (2014) 
 
Cytochrome b-c1 complex subunit 7
Name:Cytochrome b-c1 complex subunit 7
Type:PROTEIN
Mol. Mass.:13532.80
Organism:Homo sapiens (Human)
Description:ChEMBL_103899
Residue:111
BDBM50028004
NameBDBM50028004
Synonyms:CHEMBL3360267
TypeSmall organic molecule
Emp. Form.C18H14KNO3S
Mol. Mass.363.472
SMILES[K+].[O-]c1ccc(NS(=O)(=O)c2ccc(cc2)-c2ccccc2)cc1