Reaction Details
TargetRho-associated protein kinase 1
LigandBDBM14029
Substrate/Competitorn/a
Meas. Tech.ChEMBL_1432312 (CHEMBL3383292)
IC50 93±n/a nM
Citation Shaw, DHollingworth, GSoldermann, NSprague, ESchuler, WVangrevelinghe, EDuggan, NThomas, MKosaka, TWaters, Nvan Eis, MJ Novel ROCK inhibitors for the treatment of pulmonary arterial hypertension. Bioorg Med Chem Lett24:4812-7 (2014) 
 
Rho-associated protein kinase 1
Name:Rho-associated protein kinase 1
Type:Serine/threonine-protein kinase
Mol. Mass.:158156.77
Organism:Homo sapiens (Human)
Description:Q13464
Residue:1354
BDBM14029
NameBDBM14029
Synonyms:(R)-TRANS-4-(1-AMINOETHYL)-N-(4-PYRIDYL) CYCLOHEXANECARBOXAMIDE US10183931, Y-27632 | Y-27632
TypeSmall organic molecule
Emp. Form.C14H21N3O
Mol. Mass.247.336
SMILES[H][C@@]1(CC[C@@]([H])(CC1)C(=O)Nc1ccncc1)[C@@H](C)N