Reaction Details
TargetRho-associated protein kinase 2
LigandBDBM50365218
Substrate/Competitorn/a
Meas. Tech.ChEMBL_1433145 (CHEMBL3386997)
IC50 7.0±n/a nM
Citation Shaw, DHollingworth, GSoldermann, NSprague, ESchuler, WVangrevelinghe, EDuggan, NThomas, MKosaka, TWaters, Nvan Eis, MJ Novel ROCK inhibitors for the treatment of pulmonary arterial hypertension. Bioorg Med Chem Lett24:4812-7 (2014) 
 
Rho-associated protein kinase 2
Name:Rho-associated protein kinase 2
Type:Protein
Mol. Mass.:160885.43
Organism:Homo sapiens (Human)
Description:O75116
Residue:1388
BDBM50365218
NameBDBM50365218
Synonyms:CHEMBL1956071 | GSK screening, 29
TypeSmall organic molecule
Emp. Form.C15H18N8O2
Mol. Mass.342.3558
SMILESCCn1c(nc2cncc(C(=O)N3CC[C@H](N)C3)c12)-c1nonc1N