Reaction Details
TargetRho-associated protein kinase 2
LigandBDBM50028033
Substrate/Competitorn/a
Meas. Tech.ChEMBL_1433145 (CHEMBL3386997)
IC50 11±n/a nM
Citation Shaw, DHollingworth, GSoldermann, NSprague, ESchuler, WVangrevelinghe, EDuggan, NThomas, MKosaka, TWaters, Nvan Eis, MJ Novel ROCK inhibitors for the treatment of pulmonary arterial hypertension. Bioorg Med Chem Lett24:4812-7 (2014) 
 
Rho-associated protein kinase 2
Name:Rho-associated protein kinase 2
Type:Protein
Mol. Mass.:160885.43
Organism:Homo sapiens (Human)
Description:O75116
Residue:1388
BDBM50028033
NameBDBM50028033
Synonyms:CHEMBL3338837 | US11458138, Example 312
TypeSmall organic molecule
Emp. Form.C16H18N6
Mol. Mass.294.3543
SMILESCC(C)(N)CNc1nc(nc2cnccc12)-c1ccncc1