Reaction Details
TargetSerine/threonine-protein kinase N1
LigandBDBM50028036
Substrate/Competitorn/a
Meas. Tech.ChEMBL_1433150 (CHEMBL3387550)
IC50 990±n/a nM
Citation Shaw, DHollingworth, GSoldermann, NSprague, ESchuler, WVangrevelinghe, EDuggan, NThomas, MKosaka, TWaters, Nvan Eis, MJ Novel ROCK inhibitors for the treatment of pulmonary arterial hypertension. Bioorg Med Chem Lett24:4812-7 (2014) 
 
Serine/threonine-protein kinase N1
Name:Serine/threonine-protein kinase N1
Type:PROTEIN
Mol. Mass.:103928.39
Organism:Homo sapiens (Human)
Description:ChEMBL_1433150
Residue:942
BDBM50028036
NameBDBM50028036
Synonyms:CHEMBL3338840
TypeSmall organic molecule
Emp. Form.C19H18N6
Mol. Mass.330.3864
SMILESC1CN(CCN1)c1nc(nc2ccccc12)-c1ccc2[nH]ncc2c1