Reaction Details
TargetSerine/threonine-protein kinase N2
LigandBDBM50028033
Substrate/Competitorn/a
Meas. Tech.ChEMBL_1433151 (CHEMBL3387551)
IC50 58±n/a nM
Citation Shaw, DHollingworth, GSoldermann, NSprague, ESchuler, WVangrevelinghe, EDuggan, NThomas, MKosaka, TWaters, Nvan Eis, MJ Novel ROCK inhibitors for the treatment of pulmonary arterial hypertension. Bioorg Med Chem Lett24:4812-7 (2014) 
 
Serine/threonine-protein kinase N2
Name:Serine/threonine-protein kinase N2
Type:PROTEIN
Mol. Mass.:112029.78
Organism:Homo sapiens (Human)
Description:ChEMBL_1433151
Residue:984
BDBM50028033
NameBDBM50028033
Synonyms:CHEMBL3338837 | US11458138, Example 312
TypeSmall organic molecule
Emp. Form.C16H18N6
Mol. Mass.294.3543
SMILESCC(C)(N)CNc1nc(nc2cnccc12)-c1ccncc1