Reaction Details
TargetProtein kinase C eta type
LigandBDBM50028035
Substrate/Competitorn/a
Meas. Tech.ChEMBL_1433152 (CHEMBL3387552)
IC50 507±n/a nM
Citation Shaw, DHollingworth, GSoldermann, NSprague, ESchuler, WVangrevelinghe, EDuggan, NThomas, MKosaka, TWaters, Nvan Eis, MJ Novel ROCK inhibitors for the treatment of pulmonary arterial hypertension. Bioorg Med Chem Lett24:4812-7 (2014) 
 
Protein kinase C eta type
Name:Protein kinase C eta type
Type:Enzyme
Mol. Mass.:77844.26
Organism:Homo sapiens (Human)
Description:The recombinant human PKC enzymes were produced using a baculovirus expression system in SF9 cells
Residue:683
BDBM50028035
NameBDBM50028035
Synonyms:CHEMBL3338839
TypeSmall organic molecule
Emp. Form.C18H17N7
Mol. Mass.331.3745
SMILESC1CN(CCN1)c1nc(nc2cnccc12)-c1ccc2[nH]ncc2c1