Reaction Details
TargetProtein kinase C theta type
LigandBDBM50391898
Substrate/Competitorn/a
Meas. Tech.ChEMBL_1433153 (CHEMBL3387553)
IC50 141±n/a nM
Citation Shaw, DHollingworth, GSoldermann, NSprague, ESchuler, WVangrevelinghe, EDuggan, NThomas, MKosaka, TWaters, Nvan Eis, MJ Novel ROCK inhibitors for the treatment of pulmonary arterial hypertension. Bioorg Med Chem Lett24:4812-7 (2014) 
 
Protein kinase C theta type
Name:Protein kinase C theta type
Type:Serine/threonine-protein kinase
Mol. Mass.:81878.04
Organism:Homo sapiens (Human)
Description:Full-length human PKC theta (Panvera Catalog No. P2996).
Residue:706
BDBM50391898
NameBDBM50391898
Synonyms:CHEMBL2147538
TypeSmall organic molecule
Emp. Form.C17H19N5
Mol. Mass.293.3663
SMILESCC(C)(N)CNc1nc(cc2cnccc12)-c1ccncc1