Reaction Details
TargetProtein kinase C theta type
LigandBDBM50028034
Substrate/Competitorn/a
Meas. Tech.ChEMBL_1433153 (CHEMBL3387553)
IC50 995±n/a nM
Citation Shaw, DHollingworth, GSoldermann, NSprague, ESchuler, WVangrevelinghe, EDuggan, NThomas, MKosaka, TWaters, Nvan Eis, MJ Novel ROCK inhibitors for the treatment of pulmonary arterial hypertension. Bioorg Med Chem Lett24:4812-7 (2014) 
 
Protein kinase C theta type
Name:Protein kinase C theta type
Type:Serine/threonine-protein kinase
Mol. Mass.:81878.04
Organism:Homo sapiens (Human)
Description:Full-length human PKC theta (Panvera Catalog No. P2996).
Residue:706
BDBM50028034
NameBDBM50028034
Synonyms:CHEMBL3338838
TypeSmall organic molecule
Emp. Form.C18H19N7
Mol. Mass.333.3904
SMILESCC(C)(N)CNc1nc(nc2cnccc12)-c1ccc2[nH]ncc2c1