Reaction Details
TargetOrexin receptor type 2
LigandBDBM50028056
Substrate/Competitorn/a
Meas. Tech.ChEMBL_1433179 (CHEMBL3387579)
Ki 193±n/a nM
Citation Roecker, AJReger, TSMattern, MCMercer, SPBergman, JMSchreier, JDCube, RVCox, CDLi, DLemaire, WBruno, JGHarrell, CMGarson, SLGotter, ALFox, SVStevens, JTannenbaum, PLPrueksaritanont, TCabalu, TDCui, DStellabott, JHartman, GDYoung, SDWinrow, CJRenger, JJColeman, PJ Discovery of MK-3697: a selective orexin 2 receptor antagonist (2-SORA) for the treatment of insomnia. Bioorg Med Chem Lett24:4884-90 (2014) 
 
Orexin receptor type 2
Name:Orexin receptor type 2
Type:Protein
Mol. Mass.:50710.53
Organism:Homo sapiens (Human)
Description:O43614
Residue:444
BDBM50028056
NameBDBM50028056
Synonyms:CHEMBL3338859
TypeSmall organic molecule
Emp. Form.C24H22N6O3
Mol. Mass.442.4699
SMILESCOc1ccc(CNC(=O)c2cc(ncc2-c2ccnnc2)-c2cncc(C)c2)nc1OC