Reaction Details
TargetOrexin/Hypocretin receptor type 1
LigandBDBM106970
Substrate/Competitorn/a
Meas. Tech.ChEMBL_1433180 (CHEMBL3387580)
Ki 4000±n/a nM
Citation Roecker, AJReger, TSMattern, MCMercer, SPBergman, JMSchreier, JDCube, RVCox, CDLi, DLemaire, WBruno, JGHarrell, CMGarson, SLGotter, ALFox, SVStevens, JTannenbaum, PLPrueksaritanont, TCabalu, TDCui, DStellabott, JHartman, GDYoung, SDWinrow, CJRenger, JJColeman, PJ Discovery of MK-3697: a selective orexin 2 receptor antagonist (2-SORA) for the treatment of insomnia. Bioorg Med Chem Lett24:4884-90 (2014) 
 
Orexin/Hypocretin receptor type 1
Name:Orexin/Hypocretin receptor type 1
Type:Protein
Mol. Mass.:47554.50
Organism:Homo sapiens (Human)
Description:O43613
Residue:425
BDBM106970
NameBDBM106970
Synonyms:US8592457, 1-16
TypeSmall organic molecule
Emp. Form.C26H23FN4O3
Mol. Mass.458.4842
SMILESCOc1ccc(CNC(=O)c2cc(ncc2-c2cccc(F)c2)-c2cncc(C)c2)nc1OC