Reaction Details
TargetMu-type opioid receptor
LigandBDBM50028079
Substrate/Competitorn/a
Meas. Tech.ChEMBL_1434014 (CHEMBL3381486)
Ki>1000±n/a nM
Citation Hirayama, SWada, NKuroda, NIwai, TYamaotsu, NHirono, SFujii, HNagase, H Synthesis of a novel universal opioid receptor agonist with the 1,3,5-trioxazatriquinane skeleton and its pharmacologies. Bioorg Med Chem Lett24:4895-8 (2014) 
 
Mu-type opioid receptor
Name:Mu-type opioid receptor
Type:Enzyme Catalytic Domain
Mol. Mass.:44431.62
Organism:MOUSE
Description:OPIATE Mu OPRM1 MOUSE::P42866
Residue:398
BDBM50028079
NameBDBM50028079
Synonyms:CHEMBL3338867
TypeSmall organic molecule
Emp. Form.C27H27NO6
Mol. Mass.461.5064
SMILES[H][C@]12O[C@@](C)(c3ccccc3O)[C@]3([H])O[C@@](C)(c4ccccc4O)[C@]([H])(O[C@@]1(C)c1ccccc1O)N23