Reaction Details
TargetDelta-type opioid receptor
LigandBDBM50028084
Substrate/Competitorn/a
Meas. Tech.ChEMBL_1434015 (CHEMBL3381487)
Ki>1000±n/a nM
Citation Hirayama, SWada, NKuroda, NIwai, TYamaotsu, NHirono, SFujii, HNagase, H Synthesis of a novel universal opioid receptor agonist with the 1,3,5-trioxazatriquinane skeleton and its pharmacologies. Bioorg Med Chem Lett24:4895-8 (2014) 
 
Delta-type opioid receptor
Name:Delta-type opioid receptor
Type:Enzyme Catalytic Domain
Mol. Mass.:40577.25
Organism:MOUSE
Description:P32300
Residue:372
BDBM50028084
NameBDBM50028084
Synonyms:CHEMBL3338870
TypeSmall organic molecule
Emp. Form.C27H27NO6
Mol. Mass.461.5064
SMILES[H][C@]12O[C@@](C)(c3ccc(O)cc3)[C@]3([H])O[C@@](C)(c4ccc(O)cc4)[C@]([H])(O[C@@]1(C)c1ccc(O)cc1)N23