Reaction Details
TargetDelta-type opioid receptor
LigandBDBM50028073
Substrate/Competitorn/a
Meas. Tech.ChEMBL_1434015 (CHEMBL3381487)
Ki>1000±n/a nM
Citation Hirayama, SWada, NKuroda, NIwai, TYamaotsu, NHirono, SFujii, HNagase, H Synthesis of a novel universal opioid receptor agonist with the 1,3,5-trioxazatriquinane skeleton and its pharmacologies. Bioorg Med Chem Lett24:4895-8 (2014) 
 
Delta-type opioid receptor
Name:Delta-type opioid receptor
Type:Enzyme Catalytic Domain
Mol. Mass.:40577.25
Organism:MOUSE
Description:P32300
Residue:372
BDBM50028073
NameBDBM50028073
Synonyms:CHEMBL3338880
TypeSmall organic molecule
Emp. Form.C20H21NO5
Mol. Mass.355.3844
SMILES[H][C@]12CO[C@]3([H])N1[C@@]([H])(O[C@]3(C)c1ccc(O)cc1)[C@](C)(O2)c1ccc(O)cc1