Reaction Details
TargetDelta-type opioid receptor
LigandBDBM50028086
Substrate/Competitorn/a
Meas. Tech.ChEMBL_1434015 (CHEMBL3381487)
Ki>1000±n/a nM
Citation Hirayama, SWada, NKuroda, NIwai, TYamaotsu, NHirono, SFujii, HNagase, H Synthesis of a novel universal opioid receptor agonist with the 1,3,5-trioxazatriquinane skeleton and its pharmacologies. Bioorg Med Chem Lett24:4895-8 (2014) 
 
Delta-type opioid receptor
Name:Delta-type opioid receptor
Type:Enzyme Catalytic Domain
Mol. Mass.:40577.25
Organism:MOUSE
Description:P32300
Residue:372
BDBM50028086
NameBDBM50028086
Synonyms:CHEMBL3338883
TypeSmall organic molecule
Emp. Form.C13H15NO4
Mol. Mass.249.2625
SMILES[H][C@]12CO[C@]3([H])N1[C@]([H])(CO2)O[C@@]3(C)c1ccc(O)cc1