Reaction Details
TargetKappa-type opioid receptor
LigandBDBM50028063
Substrate/Competitorn/a
Meas. Tech.ChEMBL_1434021 (CHEMBL3381493)
EC50 10.0±n/a nM
Citation Hirayama, SWada, NKuroda, NIwai, TYamaotsu, NHirono, SFujii, HNagase, H Synthesis of a novel universal opioid receptor agonist with the 1,3,5-trioxazatriquinane skeleton and its pharmacologies. Bioorg Med Chem Lett24:4895-8 (2014) 
 
Kappa-type opioid receptor
Name:Kappa-type opioid receptor
Type:G Protein-Coupled Receptor (GPCR)
Mol. Mass.:42648.76
Organism:Homo sapiens (Human)
Description:P41145
Residue:380
BDBM50028063
NameBDBM50028063
Synonyms:CHEMBL3338874
TypeSmall organic molecule
Emp. Form.C20H21NO5
Mol. Mass.355.3844
SMILES[H][C@]12CO[C@]3([H])N1[C@@]([H])(O[C@@]3(C)c1ccccc1O)[C@](C)(O2)c1ccccc1O