Reaction Details
TargetBromodomain-containing protein 2
LigandBDBM50028155
Substrate/Competitorn/a
Meas. Tech.ChEMBL_1434712 (CHEMBL3382827)
IC50 3981±n/a nM
Citation Gosmini, RNguyen, VLToum, JSimon, CBrusq, JMKrysa, GMirguet, ORiou-Eymard, AMBoursier, EVTrottet, LBamborough, PClark, HChung, CWCutler, LDemont, EHKaur, RLewis, AJSchilling, MBSoden, PETaylor, SWalker, ALWalker, MDPrinjha, RKNicodème, E The discovery of I-BET726 (GSK1324726A), a potent tetrahydroquinoline ApoA1 up-regulator and selective BET bromodomain inhibitor. J Med Chem57:8111-31 (2014) 
 
Bromodomain-containing protein 2
Name:Bromodomain-containing protein 2
Type:Protein
Mol. Mass.:88085.95
Organism:Homo sapiens (Human)
Description:P25440
Residue:801
BDBM50028155
NameBDBM50028155
Synonyms:CHEMBL3354009
TypeSmall organic molecule
Emp. Form.C25H25ClN2O
Mol. Mass.404.932
SMILESC[C@H]1C[C@@H](Nc2ccc(Cl)cc2)c2cc(ccc2N1C(C)=O)-c1ccccc1C