Reaction Details
TargetBromodomain-containing protein 3
LigandBDBM50028104
Substrate/Competitorn/a
Meas. Tech.ChEMBL_1434713 (CHEMBL3382828)
IC50 25119±n/a nM
Citation Gosmini, RNguyen, VLToum, JSimon, CBrusq, JMKrysa, GMirguet, ORiou-Eymard, AMBoursier, EVTrottet, LBamborough, PClark, HChung, CWCutler, LDemont, EHKaur, RLewis, AJSchilling, MBSoden, PETaylor, SWalker, ALWalker, MDPrinjha, RKNicodème, E The discovery of I-BET726 (GSK1324726A), a potent tetrahydroquinoline ApoA1 up-regulator and selective BET bromodomain inhibitor. J Med Chem57:8111-31 (2014) 
 
Bromodomain-containing protein 3
Name:Bromodomain-containing protein 3
Type:Protein
Mol. Mass.:79571.81
Organism:Homo sapiens (Human)
Description:Q15059
Residue:726
BDBM50028104
NameBDBM50028104
Synonyms:CHEMBL3353994
TypeSmall organic molecule
Emp. Form.C24H31N3O
Mol. Mass.377.5224
SMILESC[C@H]1C[C@@H](N)c2cc(ccc2N1C(C)=O)-c1ccc(CN2CCCCC2)cc1