Reaction Details
TargetProbable global transcription activator SNF2L2
LigandBDBM50028142
Substrate/Competitorn/a
Meas. Tech.ChEMBL_1434760 (CHEMBL3383429)
IC50<31623±n/a nM
Citation Gosmini, RNguyen, VLToum, JSimon, CBrusq, JMKrysa, GMirguet, ORiou-Eymard, AMBoursier, EVTrottet, LBamborough, PClark, HChung, CWCutler, LDemont, EHKaur, RLewis, AJSchilling, MBSoden, PETaylor, SWalker, ALWalker, MDPrinjha, RKNicodème, E The discovery of I-BET726 (GSK1324726A), a potent tetrahydroquinoline ApoA1 up-regulator and selective BET bromodomain inhibitor. J Med Chem57:8111-31 (2014) 
 
Probable global transcription activator SNF2L2
Name:Probable global transcription activator SNF2L2
Type:Enzyme Catalytic Domain
Mol. Mass.:181290.91
Organism:Homo sapiens (Human)
Description:P51531
Residue:1590
BDBM50028142
NameBDBM50028142
Synonyms:CHEMBL2177300
TypeSmall organic molecule
Emp. Form.C25H23ClN2O3
Mol. Mass.434.915
SMILESC[C@H]1C[C@@H](Nc2ccc(Cl)cc2)c2cc(ccc2N1C(C)=O)-c1ccc(cc1)C(O)=O