Reaction Details
TargetTranscription intermediary factor 1-alpha
LigandBDBM50028142
Substrate/Competitorn/a
Meas. Tech.ChEMBL_1434763 (CHEMBL3383432)
IC50 10000±n/a nM
Citation Gosmini, RNguyen, VLToum, JSimon, CBrusq, JMKrysa, GMirguet, ORiou-Eymard, AMBoursier, EVTrottet, LBamborough, PClark, HChung, CWCutler, LDemont, EHKaur, RLewis, AJSchilling, MBSoden, PETaylor, SWalker, ALWalker, MDPrinjha, RKNicodème, E The discovery of I-BET726 (GSK1324726A), a potent tetrahydroquinoline ApoA1 up-regulator and selective BET bromodomain inhibitor. J Med Chem57:8111-31 (2014) 
 
Transcription intermediary factor 1-alpha
Name:Transcription intermediary factor 1-alpha
Type:PROTEIN
Mol. Mass.:116839.55
Organism:Homo sapiens (Human)
Description:ChEMBL_107998
Residue:1050
BDBM50028142
NameBDBM50028142
Synonyms:CHEMBL2177300
TypeSmall organic molecule
Emp. Form.C25H23ClN2O3
Mol. Mass.434.915
SMILESC[C@H]1C[C@@H](Nc2ccc(Cl)cc2)c2cc(ccc2N1C(C)=O)-c1ccc(cc1)C(O)=O